Проблемы с установкой драйвера

Мощный беспроводной USB-адаптер со скоростью передачи данных до 300 Мбит/с
Goodwin
Модератор
Модератор
Сообщения: 4344
Зарегистрирован: 25 май 2011, 10:56
Страна: Россия

Проблемы с установкой драйвера

Сообщение Goodwin » 07 июн 2011, 16:31

Если при установки драйвера, Вы столкнулись с проблемами, пожалуйста заполните следующую форму перед обращением:

1. Hardware версия устройства (посмотреть можно в статусе, либо на коробке)
2. Ваша операционная система (WIN XP/Vista/7, Linux, Mac OS)
3. Версия драйвера, который вы пытаетесь установить (если с диска, пишем "с диска")
4. Антивирусные программы и фаерволлы (перечислить установленные)
5. Максимально подробно описать ваши действия при установки и самой проблемы


Первичные сообщения без данной формы не рассматриваются и удаляются, а авторам выносятся предупреждения.
Перед тем, как создать тему, посетите раздел ЧАСТО ЗАДАВАЕМЫЕ ВОПРОСЫ
TP-LINK Archer C7v2
Личные сообщения по техническим проблемам без сообщения на форуме не рассматриваются!

kison
Сообщения: 3
Зарегистрирован: 04 янв 2020, 17:11
Страна: Россия

Re: Проблемы с установкой драйвера

Сообщение kison » 04 янв 2020, 17:24

1. Hardware версия устройства - V5
2. Ваша операционная система - WIN 7
3. Версия драйвера - TL-WN822N(EU)_V5_181022_Win (до этого ставил с диска, проблема была та же)
4. Антивирусные программы и фаерволлы - отсутствуют
5. Драйвер установился, адаптер мигает. Получить через него подключение к роутеру я не пробовал, ибо он мне нужен для раздачи интернета с компьютера.
Утилиту WPS установилась и не было никаких предупреждений об ошибках. Значёк программы утилиты появился в меню Пуск. Но она не запускается. Не запускается ни от имени админа, ни двойным нажатием, ни с панели меню Пуск, ни из папки во "Все программы" в меню Пуск, ни из папки в каталоге C:\Program Files (x86)\TP-Link\TP-Link Wireless Adapter WPS Tool. А без неё я не могу включить раздачу интернета с компьютера.
Для V5 не нашёл утилиту TP-LINK Wireless Configuration Utility. А от V4 она не видит адаптер. Но с ней хотя бы другие устройства начинают видеть точку доступа адаптера, но без доступа к WWW.
_____________
P.S. Отключил компьютер от мобильного роутера и попробовал получить интернет через этот TL-WN822N нажатием и удержанием кнопки на девайсе. Он тупо не видит ни одну сеть Wi-Fi, при том, что на двух смартфонах в радиусе 2х метров выставлена раздача интернета.
Ответте, пожалуйста, побыстрее, а то уже очень хочу сдать это Г обратно в магазин.

ЗЫ2 На ноуте с W8 всё тоже самое.

Maria2017
Сообщения: 536
Зарегистрирован: 16 окт 2017, 13:23
Страна: Россия

Re: Проблемы с установкой драйвера

Сообщение Maria2017 » 04 янв 2020, 19:52

Удалите утилиту WPS,она Вам не нужна для настройки адаптера в режиме точки доступа. Для дальнейшей настройки адаптера воспользуйтесь альтернативной настройкой точки доступа средства Windows, согласно следующей инструкции viewtopic.php?f=2&t=3419#p41017

viewtopic.php?f=2&t=3419

kison
Сообщения: 3
Зарегистрирован: 04 янв 2020, 17:11
Страна: Россия

Re: Проблемы с установкой драйвера

Сообщение kison » 04 янв 2020, 22:32

Maria2017 писал(а):
04 янв 2020, 19:52
Удалите утилиту WPS,она Вам не нужна для настройки адаптера в режиме точки доступа. Для дальнейшей настройки адаптера воспользуйтесь альтернативной настройкой точки доступа средства Windows, согласно следующей инструкции viewtopic.php?f=2&t=3419#p41017

viewtopic.php?f=2&t=3419
Это я уже всё нашёл. Теперь другой вопрос - как должно выглядеть содержимое .bat файла, что бы не набирать постоянно вручную в командной строке от имени Администратора команду "netsh wlan start hostednetwork" на включение точки доступа?
Сам я в батниках нуб. Нашёл что-то похожее на ответ разбирающегося, казалось, человека

Код: Выделить всё

cd c:\windows\system32
runas /savecred /user:Администратор "netsh wlan start hostednetwork"
но и он ошибся. CMD просит пароль админа для продолжения выполнения команды.
Если создать .bat просто с

Код: Выделить всё

netsh wlan start hostednetwork
то, при нажатии на него ПКМ и за тем нажатии "Открыть от имени Администратора", точка доступа запускается, а со "stop" вместо "start" - выключается. Но хочется простоты использования и возможности засунуть этот .bat в автозагрузку при необходимости.
Если поможете с батником, то буду безмерно благодарен.

kison
Сообщения: 3
Зарегистрирован: 04 янв 2020, 17:11
Страна: Россия

Re: Проблемы с установкой драйвера

Сообщение kison » 06 янв 2020, 20:50

Я вас понял. Качество техподдержки прямо пропорционально качеству поддерживаемой продукции.
Больше ТП- Линк никогда не куплю.
И да, ТП в названии бренда самое грамотное, что есть во всём этом.
Адьёс.
Флуд в теме +2

Goodwin
Модератор
Модератор
Сообщения: 4344
Зарегистрирован: 25 май 2011, 10:56
Страна: Россия

Re: Проблемы с установкой драйвера

Сообщение Goodwin » 08 янв 2020, 20:48

И вам удачи, раз вы не можете понять, что поддержка в праздники не работает.
https://www.tp-link.com/ru/support/
Неужели с 4 января не смогли "нагуглить", как открыть командную строку с админскими правами?
http://bit.ly/2QV9rRX
Перед тем, как создать тему, посетите раздел ЧАСТО ЗАДАВАЕМЫЕ ВОПРОСЫ
TP-LINK Archer C7v2
Личные сообщения по техническим проблемам без сообщения на форуме не рассматриваются!

PalkaMilka
Сообщения: 1
Зарегистрирован: 19 ноя 2020, 19:00
Страна: Россия

Re: Проблемы с установкой драйвера

Сообщение PalkaMilka » 19 ноя 2020, 20:20

1. Hardware версия устройства : tl-wn821n v5
2. Ваша операционная система: Kali linux
3. Версия драйвера, который вы пытаетесь установить: С официального сайта (последняя верси
4. Антивирусные программы и фаерволлы: Антивирусов нет фаерволла не устанавливал
5. Максимально подробно описать ваши действия при установки и самой проблемы
Я скачиваю архив и распоковываю его в /home , перехожу в директорию командой cd Driver .
Далее прописываю команду make (ниже приведён лог). Если я делаю чтото не так пожалуйста объясните как правильно установить драйвера
root@kali:/home/kali/Driver# make
"******************************************"
"NO SKRC,we will use default KSRC"
"******************************************"
make ARCH=x86_64 CROSS_COMPILE= -C /lib/modules/5.7.0-kali1-amd64/build M=/home/kali/Driver modules
make[1]: вход в каталог «/usr/src/linux-headers-5.7.0-kali1-amd64»
"******************************************"
"NO SKRC,we will use default KSRC"
"******************************************"
CC [M] /home/kali/Driver/core/rtw_cmd.o
In file included from /home/kali/Driver/include/osdep_service.h:41,
from /home/kali/Driver/include/drv_types.h:32,
from /home/kali/Driver/core/rtw_cmd.c:22:
/home/kali/Driver/include/osdep_service_linux.h: In function ‘_init_timer’:
/home/kali/Driver/include/osdep_service_linux.h:267:8: error: ‘_timer’ {aka ‘struct timer_list’} has no member named ‘data’
267 | ptimer->data = (unsigned long)cntx;
| ^~
/home/kali/Driver/include/osdep_service_linux.h:268:2: error: implicit declaration of function ‘init_timer’; did you mean ‘_init_timer’? [-Werror=implicit-function-declaration]
268 | init_timer(ptimer);
| ^~~~~~~~~~
| _init_timer
In file included from /home/kali/Driver/include/drv_types.h:35,
from /home/kali/Driver/core/rtw_cmd.c:22:
/home/kali/Driver/include/wifi.h: At top level:
/home/kali/Driver/include/wifi.h:994: warning: "IEEE80211_MAX_AMPDU_BUF" redefined
994 | #define IEEE80211_MAX_AMPDU_BUF 0x40
|
In file included from /usr/src/linux-headers-5.7.0-kali1-common/include/net/cfg80211.h:21,
from /home/kali/Driver/include/osdep_service_linux.h:81,
from /home/kali/Driver/include/osdep_service.h:41,
from /home/kali/Driver/include/drv_types.h:32,
from /home/kali/Driver/core/rtw_cmd.c:22:
/usr/src/linux-headers-5.7.0-kali1-common/include/linux/ieee80211.h:1460: note: this is the location of the previous definition
1460 | #define IEEE80211_MAX_AMPDU_BUF 0x100
|
In file included from /home/kali/Driver/include/drv_types.h:95,
from /home/kali/Driver/core/rtw_cmd.c:22:
/home/kali/Driver/include/hal_com.h:413:13: error: ‘file_path’ redeclared as different kind of symbol
413 | extern char file_path[PATH_LENGTH_MAX];
| ^~~~~~~~~
In file included from /usr/src/linux-headers-5.7.0-kali1-common/include/linux/compat.h:17,
from /usr/src/linux-headers-5.7.0-kali1-common/include/linux/ethtool.h:17,
from /usr/src/linux-headers-5.7.0-kali1-common/include/linux/netdevice.h:37,
from /home/kali/Driver/include/osdep_service_linux.h:35,
from /home/kali/Driver/include/osdep_service.h:41,
from /home/kali/Driver/include/drv_types.h:32,
from /home/kali/Driver/core/rtw_cmd.c:22:
/usr/src/linux-headers-5.7.0-kali1-common/include/linux/fs.h:3044:14: note: previous declaration of ‘file_path’ was here
3044 | extern char *file_path(struct file *, char *, int);
| ^~~~~~~~~
In file included from /home/kali/Driver/include/drv_types.h:65,
from /home/kali/Driver/core/rtw_cmd.c:22:
/home/kali/Driver/core/rtw_cmd.c: In function ‘btinfo_evt_dump’:
/home/kali/Driver/include/rtw_debug.h:187:19: error: void value not ignored as it ought to be
187 | #define _seqdump seq_printf
| ^~~~~~~~~~
/home/kali/Driver/include/rtw_debug.h:242:7: note: in expansion of macro ‘_seqdump’
242 | if(_seqdump(sel, fmt, ##arg)) /*rtw_warn_on(1)*/; \
| ^~~~~~~~
/home/kali/Driver/core/rtw_cmd.c:3293:2: note: in expansion of macro ‘DBG_871X_SEL_NL’
3293 | DBG_871X_SEL_NL(sel, "cid:0x%02x, len:%u\n", info->cid, info->len);
| ^~~~~~~~~~~~~~~
/home/kali/Driver/include/rtw_debug.h:187:19: error: void value not ignored as it ought to be
187 | #define _seqdump seq_printf
| ^~~~~~~~~~
/home/kali/Driver/include/rtw_debug.h:242:7: note: in expansion of macro ‘_seqdump’
242 | if(_seqdump(sel, fmt, ##arg)) /*rtw_warn_on(1)*/; \
| ^~~~~~~~
/home/kali/Driver/core/rtw_cmd.c:3296:3: note: in expansion of macro ‘DBG_871X_SEL_NL’
3296 | DBG_871X_SEL_NL(sel, "byte2:%s%s%s%s%s%s%s%s\n"
| ^~~~~~~~~~~~~~~
/home/kali/Driver/include/rtw_debug.h:187:19: error: void value not ignored as it ought to be
187 | #define _seqdump seq_printf
|
^~~~~~~~~~
/home/kali/Driver/include/rtw_debug.h:242:7: note: in expansion of macro ‘_seqdump’
242 | if(_seqdump(sel, fmt, ##arg)) /*rtw_warn_on(1)*/; \
| ^~~~~~~~
/home/kali/Driver/core/rtw_cmd.c:3308:3: note: in expansion of macro ‘DBG_871X_SEL_NL’
3308 | DBG_871X_SEL_NL(sel, "retry_cnt:%u\n", info->retry_cnt);
| ^~~~~~~~~~~~~~~
/home/kali/Driver/include/rtw_debug.h:187:19: error: void value not ignored as it ought to be
187 | #define _seqdump seq_printf
| ^~~~~~~~~~
/home/kali/Driver/include/rtw_debug.h:242:7: note: in expansion of macro ‘_seqdump’
242 | if(_seqdump(sel, fmt, ##arg)) /*rtw_warn_on(1)*/; \
| ^~~~~~~~
/home/kali/Driver/core/rtw_cmd.c:3311:3: note: in expansion of macro ‘DBG_871X_SEL_NL’
3311 | DBG_871X_SEL_NL(sel, "rssi:%u\n", info->rssi);
| ^~~~~~~~~~~~~~~
/home/kali/Driver/include/rtw_debug.h:187:19: error: void value not ignored as it ought to be
187 | #define _seqdump seq_printf
| ^~~~~~~~~~
/home/kali/Driver/include/rtw_debug.h:242:7: note: in expansion of macro ‘_seqdump’
242 | if(_seqdump(sel, fmt, ##arg)) /*rtw_warn_on(1)*/; \
| ^~~~~~~~
/home/kali/Driver/core/rtw_cmd.c:3314:3: note: in expansion of macro ‘DBG_871X_SEL_NL’
3314 | DBG_871X_SEL_NL(sel, "byte5:%s%s\n"
| ^~~~~~~~~~~~~~~
cc1: some warnings being treated as errors
make[3]: *** [/usr/src/linux-headers-5.7.0-kali1-common/scripts/Makefile.build:272: /home/kali/Driver/core/rtw_cmd.o] Ошибка 1
make[2]: *** [/usr/src/linux-headers-5.7.0-kali1-common/Makefile:1745: /home/kali/Driver] Ошибка 2
make[1]: *** [/usr/src/linux-headers-5.7.0-kali1-common/Makefile:180: sub-make] Ошибка 2
make[1]: выход из каталога «/usr/src/linux-headers-5.7.0-kali1-amd64»
make: *** [Makefile:1696: modules] Ошибка 2

Ame
Модератор
Модератор
Сообщения: 552
Зарегистрирован: 07 апр 2014, 11:41
Страна: Москва

Re: Проблемы с установкой драйвера

Сообщение Ame » 28 ноя 2020, 19:42

Попробуйте использовать - https://github.com/clnhub/rtl8192eu-linux

Ответить

Вернуться в «TL-WN822N»