Не собирается драйвер под Linux (Ubuntu 16.04)

Компактный беспроводной сетевой USB-адаптер серии N со скоростью передачи данных до 150 Мбит/с
Ответить
un1t
Сообщения: 1
Зарегистрирован: 05 окт 2016, 12:47
Страна: Россия

Не собирается драйвер под Linux (Ubuntu 16.04)

Сообщение un1t » 05 окт 2016, 12:54

Название темы: /Не собирается драйвер под Linux (Ubuntu 16.04)
Режим работы адаптера: Принимает WIFI
Операционная система: Ubuntu 16.04
Описание проблемы: Скачал драйвер с сайта TL-WN723N_V3_150909
При сборке выдает ошибку.
/Downloads/TL-WN723N_V3_150909/Driver$ make
...
^
/home/bdiang/Downloads/TL-WN723N_V3_150909/Driver/include/rtw_debug.h:187:19: error: void value not ignored as it ought to be
#define _seqdump seq_printf
^
/home/bdiang/Downloads/TL-WN723N_V3_150909/Driver/include/rtw_debug.h:240:7: note: in expansion of macro ‘_seqdump’
if(_seqdump(sel, fmt, ##arg)) /*rtw_warn_on(1)*/; \
^
/home/bdiang/Downloads/TL-WN723N_V3_150909/Driver/core/rtw_debug.c:1553:3: note: in expansion of macro ‘DBG_871X_SEL_NL’
DBG_871X_SEL_NL(m, "ch=%d, ch_offset=%d, bw=%d\n",
^
/home/bdiang/Downloads/TL-WN723N_V3_150909/Driver/include/rtw_debug.h:187:19: error: void value not ignored as it ought to be
#define _seqdump seq_printf
^
/home/bdiang/Downloads/TL-WN723N_V3_150909/Driver/include/rtw_debug.h:240:7: note: in expansion of macro ‘_seqdump’
if(_seqdump(sel, fmt, ##arg)) /*rtw_warn_on(1)*/; \
^
/home/bdiang/Downloads/TL-WN723N_V3_150909/Driver/core/rtw_debug.c:1556:3: note: in expansion of macro ‘DBG_871X_SEL_NL’
DBG_871X_SEL_NL(m, "Monitor mode : Disable\n");
^
cc1: some warnings being treated as errors
scripts/Makefile.build:258: recipe for target '/home/bdiang/Downloads/TL-WN723N_V3_150909/Driver/core/rtw_debug.o' failed
make[2]: *** [/home/bdiang/Downloads/TL-WN723N_V3_150909/Driver/core/rtw_debug.o] Error 1
Makefile:1403: recipe for target '_module_/home/bdiang/Downloads/TL-WN723N_V3_150909/Driver' failed
make[1]: *** [_module_/home/bdiang/Downloads/TL-WN723N_V3_150909/Driver] Error 2
make[1]: Leaving directory '/usr/src/linux-headers-4.4.0-38-generic'
Makefile:1367: recipe for target 'modules' failed
make: *** [modules] Error 2
Весь листинг можно посмотреть тут (на форме не влезает в ограничения на размер сообщения): http://pastebin.com/raw/6CGPK2ik

Ответить

Вернуться в «TL-WN723N»